Target
D(2) dopamine receptor
Ligand
BDBM81487
Substrate
Ki
56±n/a nM
Comments
PDSP_540
Citation
 Roth, BLTandra, SBurgess, LHSibley, DRMeltzer, HY D4 dopamine receptor binding affinity does not distinguish between typical and atypical antipsychotic drugs. Psychopharmacology (Berl) 120:365-8 (1995)  
Target
Name:
D(2) dopamine receptor
Synonyms:
DOPAMINE D2 DOPAMINE D2 Short Dopamine D2 receptor Drd2
Type:
G Protein-Coupled Receptor (GPCR)
Mol. Mass.:
50931.60
Organism:
Rattus norvegicus (rat)
Description:
P61169
Residue:
444
  
Inhibitor
Name:
BDBM81487
Synonyms:
CAS_10457-91-7 NSC_25293
Type:
Small organic molecule
Emp. Form.:
C22H22ClF4NO2
Mol. Mass.:
443.862
SMILES:
OC1(CCN(CCCC(=O)c2ccc(F)cc2)CC1)c1ccc(Cl)c(c1)C(F)(F)F
: