Target
D(2) dopamine receptor
Ligand
BDBM81770
Substrate
Ki
1584±n/a nM
Comments
PDSP_1797
Citation
 Roth, BLTandra, SBurgess, LHSibley, DRMeltzer, HY D4 dopamine receptor binding affinity does not distinguish between typical and atypical antipsychotic drugs. Psychopharmacology (Berl) 120:365-8 (1995)  
Target
Name:
D(2) dopamine receptor
Synonyms:
DOPAMINE D2 DOPAMINE D2 Short Dopamine D2 receptor Drd2
Type:
G Protein-Coupled Receptor (GPCR)
Mol. Mass.:
50931.60
Organism:
Rattus norvegicus (rat)
Description:
P61169
Residue:
444
  
Inhibitor
Name:
BDBM81770
Synonyms:
CAS_82650-83-7 TENILAPINE
Type:
Small organic molecule
Emp. Form.:
C17H16N4S2
Mol. Mass.:
340.466
SMILES:
CN1CCN(CC1)C1=Nc2cscc2C(=CC#N)c2cscc12
: