Target
D(4) dopamine receptor
Ligand
BDBM22870
Substrate
Ki
92±n/a nM
Comments
PDSP_290
Citation
 Roth, BLTandra, SBurgess, LHSibley, DRMeltzer, HY D4 dopamine receptor binding affinity does not distinguish between typical and atypical antipsychotic drugs. Psychopharmacology (Berl) 120:365-8 (1995)  
Target
Name:
D(4) dopamine receptor
Synonyms:
D(4) dopamine receptor DOPAMINE D4.4 Dopamine receptor | Drd4
Type:
Enzyme Catalytic Domain
Mol. Mass.:
41307.65
Organism:
RAT
Description:
DOPAMINE D4.4 0 RAT::P30729
Residue:
387
  
Inhibitor
Name:
BDBM22870
Synonyms:
13-chloro-10-(piperazin-1-yl)-2-oxa-9-azatricyclo[9.4.0.0^{3,8}]pentadeca-1(11),3,5,7,9,12,14-heptaene Amoxapine CHEMBL1113 | Demolox
Type:
Small organic molecule
Emp. Form.:
C17H16ClN3O
Mol. Mass.:
313.781
SMILES:
Clc1ccc2Oc3ccccc3N=C(N3CCNCC3)c2c1
: