Target
D(2) dopamine receptor
Ligand
BDBM22869
Substrate
Ki
1200±n/a nM
Comments
PDSP_552
Citation
 Seeman, PVan Tol, HH Deriving the therapeutic concentrations for clozapine and haloperidol: the apparent dissociation constant of a neuroleptic at the dopamine D2 or D4 receptor varies with the affinity of the competing radioligand. Eur J Pharmacol 291:59-66 (1995)  
Target
Name:
D(2) dopamine receptor
Synonyms:
DOPAMINE D2 | DRD2
Type:
Enzyme Catalytic Domain
Mol. Mass.:
50730.78
Organism:
GUINEA PIG
Description:
F1SM69
Residue:
443
  
Inhibitor
Name:
BDBM22869
Synonyms:
6-chloro-10-(4-methylpiperazin-1-yl)-2,9-diazatricyclo[9.4.0.0^{3,8}]pentadeca-1,3(8),4,6,10,12,14-heptaene Clozapine US10259786, Clozapine
Type:
Small organic molecule
Emp. Form.:
C18H19ClN4
Mol. Mass.:
326.823
SMILES:
CN1CCN(CC1)C1=c2ccccc2=Nc2ccc(Cl)cc2N1
: