Target
Histamine H1 receptor
Ligand
BDBM50017696
Substrate
Ki
4±n/a nM
Comments
PDSP_1533
Citation
 Borsini, FGiraldo, EMonferini, EAntonini, GParenti, MBietti, GDonetti, A BIMT 17, a 5-HT2A receptor antagonist and 5-HT1A receptor full agonist in rat cerebral cortex. Naunyn Schmiedebergs Arch Pharmacol 352:276-82 (1995)  
Target
Name:
Histamine H1 receptor
Synonyms:
HISTAMINE H1 Hrh1
Type:
Enzyme Catalytic Domain
Mol. Mass.:
55716.35
Organism:
RAT
Description:
HISTAMINE H1 HRH1 RAT::P31390
Residue:
486
  
Inhibitor
Name:
BDBM50017696
Synonyms:
(2-dimethylamino-2-methyl)ethyl-N-dibenzoparathiazine 10-[2-(dimethylamino)propyl]phenothiazine N,N,alpha-trimethyl-10H-phenothiazine-10-ethanamine PROMETHAZINE proazamine
Type:
Small organic molecule
Emp. Form.:
C17H20N2S
Mol. Mass.:
284.419
SMILES:
CC(CN1c2ccccc2Sc2ccccc12)N(C)C
: