Target
Substance-P receptor
Ligand
BDBM50071112
Substrate
Ki
593±n/a nM
Comments
PDSP_1755
Citation
 Kudlacz, EMShatzer, SAKnippenberg, RWLogan, DEPoirot, Mvan Giersbergen, PLBurkholder, TP In vitro and in vivo characterization of MDL 105,212A, a nonpeptide NK-1/NK-2 tachykinin receptor antagonist. J Pharmacol Exp Ther 277:840-51 (1996) Target
Name:
Substance-P receptor
Synonyms:
NK-1 receptor NK1 Receptor NK1R_HUMAN Neurokinin-1 (NK-1) SPR TACR1 Tachykinin receptor 1 (NK1) | tachykinin
Type:
G Protein-Coupled Receptor (GPCR)
Mol. Mass.:
46254.43
Organism:
Homo sapiens (Human)
Description:
P25103
Residue:
407
  
Inhibitor
Name:
BDBM50071112
Synonyms:
CHEMBL56835 SR 48968
Type:
Small organic molecule
Emp. Form.:
C31H35Cl2N3O2
Mol. Mass.:
552.535
SMILES:
CN(CC(CCN1CCC(CC1)(NC(C)=O)c1ccccc1)c1ccc(Cl)c(Cl)c1)C(=O)c1ccccc1
: