Target
Substance-K receptor
Ligand
BDBM84954
Substrate
Ki
434±n/a nM
Comments
PDSP_823
Citation
 Kudlacz, EMShatzer, SAKnippenberg, RWLogan, DEPoirot, Mvan Giersbergen, PLBurkholder, TP In vitro and in vivo characterization of MDL 105,212A, a nonpeptide NK-1/NK-2 tachykinin receptor antagonist. J Pharmacol Exp Ther 277:840-51 (1996) Target
Name:
Substance-K receptor
Synonyms:
NK-2 receptor NK2R NKNAR Neurokinin A receptor Neurokinin-2 (NK-2) SKR TACR2 Tachykinin receptor 2 (NK2) | hnk-3
Type:
Protein
Mol. Mass.:
44455.78
Organism:
Homo sapiens (Human)
Description:
P21452
Residue:
398
  
Inhibitor
Name:
BDBM84954
Synonyms:
CAS_6437864 NSC_6437864
Type:
Small organic molecule
Emp. Form.:
C54H72N8O13
Mol. Mass.:
1041.1953
SMILES:
CCCCCc1ccccc1CCC(=O)NC1C(C)OC(=O)C(CO)NC(=O)C(CC(N)=O)NC(=O)C(NC(=O)C(Cc2ccccc2)NC(=O)C(CC(C)C)NC(=O)C(=Cc2ccc(O)cc2)N(C)C1=O)C(C)O
: