Target
Substance-K receptor
Ligand
BDBM50071112
Substrate
Ki
0.71±n/a nM
Comments
PDSP_1755
Citation
 Kudlacz, EMShatzer, SAKnippenberg, RWLogan, DEPoirot, Mvan Giersbergen, PLBurkholder, TP In vitro and in vivo characterization of MDL 105,212A, a nonpeptide NK-1/NK-2 tachykinin receptor antagonist. J Pharmacol Exp Ther 277:840-51 (1996) Target
Name:
Substance-K receptor
Synonyms:
NK-2 receptor NK2R_BOVIN Neurokinin A receptor Substance-K receptor TACR2 | Tachykinin receptor 2
Type:
PROTEIN
Mol. Mass.:
43078.78
Organism:
Bos taurus
Description:
ChEMBL_143050
Residue:
384
  
Inhibitor
Name:
BDBM50071112
Synonyms:
CHEMBL56835 SR 48968
Type:
Small organic molecule
Emp. Form.:
C31H35Cl2N3O2
Mol. Mass.:
552.535
SMILES:
CN(CC(CCN1CCC(CC1)(NC(C)=O)c1ccccc1)c1ccc(Cl)c(Cl)c1)C(=O)c1ccccc1
: