Target
Neuromedin-K receptor
Ligand
BDBM50071112
Substrate
Ki
208±n/a nM
Comments
PDSP_1755
Citation
 Kudlacz, EMShatzer, SAKnippenberg, RWLogan, DEPoirot, Mvan Giersbergen, PLBurkholder, TP In vitro and in vivo characterization of MDL 105,212A, a nonpeptide NK-1/NK-2 tachykinin receptor antagonist. J Pharmacol Exp Ther 277:840-51 (1996) Target
Name:
Neuromedin-K receptor
Synonyms:
NK3R_CAVPO Neurokinin NK3 TACR3
Type:
Enzyme Catalytic Domain
Mol. Mass.:
49456.44
Organism:
GUINEA PIG
Description:
Neurokinin NK3 TACR3 GUINEA PIG::P30098
Residue:
440
  
Inhibitor
Name:
BDBM50071112
Synonyms:
CHEMBL56835 SR 48968
Type:
Small organic molecule
Emp. Form.:
C31H35Cl2N3O2
Mol. Mass.:
552.535
SMILES:
CN(CC(CCN1CCC(CC1)(NC(C)=O)c1ccccc1)c1ccc(Cl)c(Cl)c1)C(=O)c1ccccc1
: