Target
Neuropeptide Y receptor type 5
Ligand
BDBM82282
Substrate
Ki
109±n/a nM
Comments
PDSP_1381
Citation
 Weinberg, DHSirinathsinghji, DJTan, CPShiao, LLMorin, NRigby, MRHeavens, RHRapoport, DRBayne, MLCascieri, MAStrader, CDLinemeyer, DLMacNeil, DJ Cloning and expression of a novel neuropeptide Y receptor. J Biol Chem 271:16435-8 (1996)  
Target
Name:
Neuropeptide Y receptor type 5
Synonyms:
NPY-Y5 Neuropeptide Y receptor Y5 Npy5 | Npy5r
Type:
Enzyme
Mol. Mass.:
52807.91
Organism:
Mus musculus (Mouse)
Description:
O70342
Residue:
466
  
Inhibitor
Name:
BDBM82282
Synonyms:
NPY13-36 | NPY13-36, porcine
Type:
Small organic molecule
Emp. Form.:
C135H209N41O36
Mol. Mass.:
2982.3571
SMILES:
CC[C@H](C)[C@H](NC(=O)[C@H](Cc1ccc(O)cc1)NC(=O)[C@H](Cc1cnc[nH]1)NC(=O)[C@H](CCCN=C(N)N)NC(=O)[C@H](CC(C)C)NC(=O)[C@H](C)NC(=O)[C@H](CO)NC(=O)[C@H](Cc1ccc(O)cc1)NC(=O)[C@H](Cc1ccc(O)cc1)NC(=O)[C@H](CCCN=C(N)N)NC(=O)[C@H](C)NC(=O)[C@H](CC(C)C)NC(=O)[C@H](CC(O)=O)NC(=O)[C@H](CCC(O)=O)NC(=O)[C@H](C)NC(=O)[C@@H]1CCCN1)C(=O)N[C@@H](CC(N)=O)C(=O)N[C@@H](CC(C)C)C(=O)N[C@@H]([C@@H](C)CC)C(=O)N[C@@H]([C@@H](C)O)C(=O)N[C@@H](CCCN=C(N)N)C(=O)N[C@@H](CCC(N)=O)C(=O)N[C@@H](CCCN=C(N)N)C(=O)N[C@@H](Cc1ccc(O)cc1)C(N)=O
: