Target
Metabotropic glutamate receptor 3
Ligand
BDBM17660
Substrate
Ki
>10000±n/a nM
Comments
PDSP_1580
Citation
 Flor, PJGomeza, JTones, MAKuhn, RPin, JPKnöpfel, T The C-terminal domain of the mGluR1 metabotropic glutamate receptor affects sensitivity to agonists. J Neurochem 67:58-63 (1996)  
Target
Name:
Metabotropic glutamate receptor 3
Synonyms:
GPRC1C GRM3_HUMAN metabotropic glutamate 3 metabotropic glutamate 3/1c
Type:
Enzyme Catalytic Domain
Mol. Mass.:
98889.09
Organism:
Homo sapiens (Human)
Description:
metabotropic glutamate 1c 0 HUMAN::Q14832
Residue:
879
  
Inhibitor
Name:
BDBM17660
Synonyms:
(2S)-2-amino-3-(3,5-dioxo-1,2,4-oxadiazolidin-2-yl)propanoic acid CHEMBL279956 Quisqualate, L | quisqualic acid
Type:
Small organic molecule
Emp. Form.:
C5H7N3O5
Mol. Mass.:
189.1262
SMILES:
N[C@@H](Cn1oc(=O)[nH]c1=O)C(O)=O
: