Target
Gastrin/cholecystokinin type B receptor
Ligand
BDBM50185261
Substrate
Ki
>10000±n/a nM
Comments
PDSP_2197
Citation
 Akiyama, TTachibana, IHirohata, YShirohara, HYamamoto, MOtsuki, M Pharmacological profile of TP-680, a new cholecystokininA receptor antagonist. Br J Pharmacol 117:1558-64 (1996)  
Target
Name:
Gastrin/cholecystokinin type B receptor
Synonyms:
Cckbr Cholecystokinin B receptor GASR_RAT | Gastrin/cholecystokinin type B receptor
Type:
Enzyme Catalytic Domain
Mol. Mass.:
48980.43
Organism:
RAT
Description:
Cholecystokinin A CCKBR RAT::P30553
Residue:
452
  
Inhibitor
Name:
BDBM50185261
Synonyms:
4-(3,4-dichlorobenzamido)-5-((3-methoxypropyl)(pentyl)amino)-5-oxopentanoic acid LOXIGLUMIDE
Type:
Small organic molecule
Emp. Form.:
C21H30Cl2N2O5
Mol. Mass.:
461.379
SMILES:
CCCCCN(CCCOC)C(=O)C(CCC(O)=O)NC(=O)c1ccc(Cl)c(Cl)c1
: