Target
5-hydroxytryptamine receptor 1B
Ligand
BDBM82472
Substrate
Ki
>10000±n/a nM
Comments
PDSP_456
Citation
 Baxter, GS Novel discriminatory ligands for 5-HT2B receptors. Behav Brain Res 73:149-52 (1996)  
Target
Name:
5-hydroxytryptamine receptor 1B
Synonyms:
5-HT1 like HTR1B
Type:
Enzyme Catalytic Domain
Mol. Mass.:
43509.20
Organism:
RABBIT
Description:
5-HT1 like 0 RABBIT::P49144
Residue:
390
  
Inhibitor
Name:
BDBM82472
Synonyms:
BW-723C86 NSC_5311036
Type:
Small organic molecule
Emp. Form.:
C16H18N2OS
Mol. Mass.:
286.392
SMILES:
CC(N)Cc1c[nH]c2ccc(OCc3cccs3)cc12
: