Target
Beta-1 adrenergic receptor
Ligand
BDBM82272
Substrate
Ki
>10000±n/a nM
Comments
PDSP_7268
Citation
 Baxter, GS Novel discriminatory ligands for 5-HT2B receptors. Behav Brain Res 73:149-52 (1996)  
Target
Name:
Beta-1 adrenergic receptor
Synonyms:
ADRB1R, B1AR Adrb1 Adrenergic receptor beta Beta-1 adrenoreceptor adrenergic Beta1,2
Type:
Protein
Mol. Mass.:
50486.84
Organism:
Rattus norvegicus (Rat)
Description:
P18090
Residue:
466
  
Inhibitor
Name:
BDBM82272
Synonyms:
SB 200646 | SB200646a
Type:
Emp. Form.:
C15H14N4O
Mol. Mass.:
266.2979
SMILES:
Cn1ccc2cc(NC(=O)Nc3cccnc3)ccc12
: