Target
Gamma-aminobutyric acid receptor subunit alpha-1
Ligand
BDBM84993
Substrate
Ki
0.15±n/a nM
Comments
PDSP_493
Citation
 Scholze, PEbert, VSieghart, W Affinity of various ligands for GABAA receptors containing alpha 4 beta 3 gamma 2, alpha 4 gamma 2, or alpha 1 beta 3 gamma 2 subunits. Eur J Pharmacol 304:155-62 (1996)  
Target
Name:
Gamma-aminobutyric acid receptor subunit alpha-1
Synonyms:
Benzodiazepine central GABA A Benzodiazepine liver GABA(A) receptor subunit alpha-1 GABA-A receptor GBRA1_HUMAN TBPS | agonist GABA site
Type:
Protein
Mol. Mass.:
51817.35
Organism:
Homo sapiens (Human)
Description:
P14867
Residue:
456
  
Inhibitor
Name:
BDBM84993
Synonyms:
5,6,7,8,9,10-Hexahydro-2-(4-methoxyphenyl)cyclohepta[b]pyrazolo[3,4-d]pyridin-3(2H)-one CGS-20625
Type:
Small organic molecule
Emp. Form.:
C18H19N3O2
Mol. Mass.:
309.3624
SMILES:
COc1ccc(cc1)-n1[nH]c2c3CCCCCc3ncc2c1=O
: