Target
5-hydroxytryptamine receptor 4
Ligand
BDBM82422
Substrate
Ki
243±n/a nM
Comments
PDSP_1594
Citation
 Adham, NGerald, CSchechter, LVaysse, PWeinshank, RBranchek, T [3H]5-hydroxytryptamine labels the agonist high affinity state of the cloned rat 5-HT4 receptor. Eur J Pharmacol 304:231-5 (1996)  
Target
Name:
5-hydroxytryptamine receptor 4
Synonyms:
5-HT-4 5-HT4L 5-hydroxytryptamine receptor 4 Htr4 Serotonin 4 (5-HT4) receptor
Type:
Enzyme Catalytic Domain
Mol. Mass.:
46117.31
Organism:
RAT
Description:
5-HT4 HTR4 RAT::Q62758
Residue:
406
  
Inhibitor
Name:
BDBM82422
Synonyms:
CAS_109872-41-5 RENZAPRIDE
Type:
Small organic molecule
Emp. Form.:
C16H22ClN3O2
Mol. Mass.:
323.818
SMILES:
COc1cc(N)c(Cl)cc1C(=O)NC1CCN2CCCC1C2
: