Target
Neuropeptide Y receptor type 5
Ligand
BDBM82285
Substrate
Ki
206±n/a nM
Comments
PDSP_1384
Citation
 Hu, YBloomquist, BTCornfield, LJDeCarr, LBFlores-Riveros, JRFriedman, LJiang, PLewis-Higgins, LSadlowski, YSchaefer, JVelazquez, NMcCaleb, ML Identification of a novel hypothalamic neuropeptide Y receptor associated with feeding behavior. J Biol Chem 271:26315-9 (1996)  
Target
Name:
Neuropeptide Y receptor type 5
Synonyms:
NPY-Y5 Neuropeptide Y receptor type 5 Npyr5
Type:
Enzyme Catalytic Domain
Mol. Mass.:
50435.58
Organism:
Rat 6B
Description:
NPY-Y5 NPY5R Rat 6B::Q63634
Residue:
445
  
Inhibitor
Name:
BDBM82285
Synonyms:
NPY 18-36 NPY18-36, porcine
Type:
Small organic molecule
Emp. Form.:
C112H174N36O27
Mol. Mass.:
2456.805
SMILES:
CC[C@H](C)[C@H](NC(=O)[C@H](Cc1ccc(O)cc1)NC(=O)[C@H](Cc1cnc[nH]1)NC(=O)[C@H](CCCN=C(N)N)NC(=O)[C@H](CC(C)C)NC(=O)[C@H](C)NC(=O)[C@H](CO)NC(=O)[C@H](Cc1ccc(O)cc1)NC(=O)[C@H](Cc1ccc(O)cc1)NC(=O)[C@H](CCCN=C(N)N)NC(=O)[C@H](C)N)C(=O)N[C@@H](CC(N)=O)C(=O)N[C@@H](CC(C)C)C(=O)N[C@@H]([C@@H](C)CC)C(=O)N[C@@H]([C@@H](C)O)C(=O)N[C@@H](CCCN=C(N)N)C(=O)N[C@@H](CCC(N)=O)C(=O)N[C@@H](CCCN=C(N)N)C(=O)N[C@@H](Cc1ccc(O)cc1)C(N)=O
: