Target
5-hydroxytryptamine receptor 4
Ligand
BDBM85018
Substrate
Ki
37.15±n/a nM
Comments
PDSP_1674
Citation
 Ansanay, HSebben, MBockaert, JDumuis, A Pharmacological comparison between [3H]GR 113808 binding sites and functional 5-HT4 receptors in neurons. Eur J Pharmacol 298:165-74 (1996)  
Target
Name:
5-hydroxytryptamine receptor 4
Synonyms:
5-HT-4 5-HT4L 5HT4R_MOUSE Serotonin 4 (5-HT4) receptor | Serotonin receptor 4
Type:
Enzyme Catalytic Domain
Mol. Mass.:
43970.99
Organism:
MOUSE
Description:
5-HT4 HTR4 MOUSE::P97288
Residue:
388
  
Inhibitor
Name:
BDBM85018
Synonyms:
SB205149
Type:
Small organic molecule
Emp. Form.:
C19H29ClN3O2
Mol. Mass.:
366.905
SMILES:
CCCC[N+]12CCC(C1)C(CC2)NC(=O)c1cc(Cl)c(N)cc1OC
: