Target
5-hydroxytryptamine receptor 4
Ligand
BDBM50005833
Substrate
Ki
50.11±n/a nM
Comments
PDSP_1681
Citation
 Ansanay, HSebben, MBockaert, JDumuis, A Pharmacological comparison between [3H]GR 113808 binding sites and functional 5-HT4 receptors in neurons. Eur J Pharmacol 298:165-74 (1996)  
Target
Name:
5-hydroxytryptamine receptor 4
Synonyms:
5-HT-4 5-HT4L 5HT4R_MOUSE Serotonin 4 (5-HT4) receptor | Serotonin receptor 4
Type:
Enzyme Catalytic Domain
Mol. Mass.:
43970.99
Organism:
MOUSE
Description:
5-HT4 HTR4 MOUSE::P97288
Residue:
388
  
Inhibitor
Name:
BDBM50005833
Synonyms:
(exo)4-Amino-5-chloro-N-(hexahydro-pyrrolizin-1-ylmethyl)-2-methoxy-benzamide 4-Amino-5-chloro-N-(hexahydro-pyrrolizin-2-ylmethyl)-2-methoxy-benzamide 4-amino-5-chloro-N-[(1S-cis-hexahydro-1H-pyrrolizin-1-yl)-methyl]-2-methoxybenzenecarboxamide SC-53116 SC53116
Type:
Small organic molecule
Emp. Form.:
C16H22ClN3O2
Mol. Mass.:
323.818
SMILES:
COc1cc(N)c(Cl)cc1C(=O)NC[C@@H]1CCN2CCC[C@@H]12
: