Target
Sodium-dependent serotonin transporter
Ligand
BDBM50254790
Substrate
Ki
3.15±n/a nM
Comments
PDSP_1361
Citation
 Pälvimäki, EPRoth, BLMajasuo, HLaakso, AKuoppamäki, MSyvälahti, EHietala, J Interactions of selective serotonin reuptake inhibitors with the serotonin 5-HT2c receptor. Psychopharmacology (Berl) 126:234-40 (1996)  
Target
Name:
Sodium-dependent serotonin transporter
Synonyms:
5-HT Transporter 5HT transporter Anandamid membrane transporter, AMT Monoamine transporters; Norepinephrine & serotonin Slc6a4 Sodium-dependent serotonin transporter (SERT) | imipramine receptor
Type:
Multi-pass membrane protein
Mol. Mass.:
70168.43
Organism:
Rattus norvegicus (rat)
Description:
P31652
Residue:
630
  
Inhibitor
Name:
BDBM50254790
Synonyms:
(S)-Norfluoxetine NORFLUOXETINE
Type:
Small organic molecule
Emp. Form.:
C16H16F3NO
Mol. Mass.:
295.2995
SMILES:
NCC[C@H](Oc1ccc(cc1)C(F)(F)F)c1ccccc1
: