Target
Melanocortin receptor 4
Ligand
BDBM85022
Substrate
Ki
122±n/a nM
Comments
PDSP_3048
Citation
 Schiöth, HBMuceniece, RWikberg, JE Characterisation of the melanocortin 4 receptor by radioligand binding. Pharmacol Toxicol 79:161-5 (1996)  
Target
Name:
Melanocortin receptor 4
Synonyms:
MC4-R MC4R_HUMAN Melanocortin receptor 4 (MC-4) Melanocortin receptor 4 (MC4R)
Type:
Enzyme
Mol. Mass.:
36949.50
Organism:
Homo sapiens (Human)
Description:
P32245
Residue:
332
  
Inhibitor
Name:
BDBM85022
Synonyms:
alpha-MSH, [Nle4]
Type:
Small organic molecule
Emp. Form.:
C78H110N20O20
Mol. Mass.:
1647.83
SMILES:
CCCC[C@H](NC(=O)[C@H](CO)NC(=O)[C@H](Cc1ccc(O)cc1)NC(=O)[C@H](CO)NC(C)=O)C(=O)N[C@@H](CCC(O)=O)C(=O)N[C@@H](Cc1cnc[nH]1)C(=O)N[C@@H](Cc1ccccc1)C(=O)N[C@@H](CCCN=C(N)N)C(=O)N[C@@H](Cc1c[nH]c2ccccc12)C(=O)NCC(=O)N[C@@H](CCCCN)C(=O)N1CCC[C@H]1C(=O)N[C@@H](C(C)C)C(O)=O
: