Target
5-hydroxytryptamine receptor 4
Ligand
BDBM85026
Substrate
Ki
0.39±n/a nM
Comments
PDSP_1664
Citation
 Hegde, SSEglen, RM Peripheral 5-HT4 receptors. FASEB J 10:1398-407 (1996)  
Target
Name:
5-hydroxytryptamine receptor 4
Synonyms:
5-HT4 5HT4R_CAVPO Serotonin 4 (5-HT4) receptor
Type:
Enzyme Catalytic Domain
Mol. Mass.:
43735.29
Organism:
GUINEA PIG
Description:
5-HT4 HTR4 GUINEA PIG::O70528
Residue:
388
  
Inhibitor
Name:
BDBM85026
Synonyms:
N-(1-Butylpiperidine-4-ylmethyl)-1,2-(trimethyleneoxy)-1H-indole-3-carboxamide SB-207266
Type:
Small organic molecule
Emp. Form.:
C22H31N3O2
Mol. Mass.:
369.5004
SMILES:
CCCCN1CCC(CNC(=O)c2c3OCCCn3c3ccccc23)CC1
: