Target
Diacylglycerol O-acyltransferase 2
Ligand
BDBM274961
Substrate
Meas. Tech.
Enzymatic Activity Assay
pH
7±n/a
Temperature
298.15±n/a K
IC50
1.75±n/a nM
Comments
extracted
Citation
 Imbriglio, JLondon, CLu, ZTata, JXiong, YYou, MYoum, H Tetrahydroisoquinoline derivatives useful as inhibitors of diacylglyceride O-acyltransferase 2 US Patent  US9877957 Publication Date 1/30/2018 
Target
Name:
Diacylglycerol O-acyltransferase 2
Synonyms:
ARAT DGAT2 Diacylglycerol O-acyltransferase 2 (DGAT2) Retinol O-fatty-acyltransferase
Type:
Multi-pass membrane protein
Mol. Mass.:
43848.90
Organism:
Homo sapiens (Human)
Description:
Q96PD7
Residue:
388
  
Inhibitor
Name:
BDBM274961
Synonyms:
US9877957, Example 1
Type:
Small organic molecule
Emp. Form.:
C36H41F3N4O4
Mol. Mass.:
650.7303
SMILES:
COC(=O)c1cccc(c1)-c1ccc(CNC(=O)C2CCN(CC2)c2ccc(cc2)C(F)(F)F)c2CN(CCc12)C(=O)NC(C)(C)C
: