Target
Histamine H1 receptor
Ligand
BDBM50292411
Substrate
Ki
1±n/a nM
Comments
PDSP_1917
Citation
 Moguilevsky, NVarsalona, FGuillaume, JPNoyer, MGillard, MDaliers, JHenichart, JPBollen, A Pharmacological and functional characterisation of the wild-type and site-directed mutants of the human H1 histamine receptor stably expressed in CHO cells. J Recept Signal Transduct Res 15:91-102 (1995)  
Target
Name:
Histamine H1 receptor
Synonyms:
H1R HISTAMINE H1 HRH1_HUMAN
Type:
G Protein-Coupled Receptor (GPCR)
Mol. Mass.:
55808.72
Organism:
Homo sapiens (Human)
Description:
Cell pellets from SK-N-MC cells transfected with human H1 receptor were used in binding assay.
Residue:
487
  
Inhibitor
Name:
BDBM50292411
Synonyms:
(E)-2-(3-(pyrrolidin-1-yl)-1-p-tolylprop-1-enyl)pyridine 2-((E)-3-Pyrrolidin-1-yl-1-p-tolyl-propenyl)-pyridine 2-(3-Pyrrolidin-1-yl-1-p-tolyl-propenyl)-pyridine Actidil Allerfed Corphed Myfed TRIPROLIDINE Trilitron Triprolidin
Type:
Small organic molecule
Emp. Form.:
C19H22N2
Mol. Mass.:
278.3914
SMILES:
Cc1ccc(cc1)C(=C/CN1CCCC1)\c1ccccn1
: