Target
Muscarinic acetylcholine receptor M2
Ligand
BDBM50001786
Substrate
Ki
5000±n/a nM
Comments
PDSP_1709
Citation
 Schotte, AJanssen, PFGommeren, WLuyten, WHVan Gompel, PLesage, ASDe Loore, KLeysen, JE Risperidone compared with new and reference antipsychotic drugs: in vitro and in vivo receptor binding. Psychopharmacology (Berl) 124:57-73 (1996)  
Target
Name:
Muscarinic acetylcholine receptor M2
Synonyms:
ACM2_RAT Chrm-2 | Chrm2
Type:
Enzyme Catalytic Domain
Mol. Mass.:
51555.53
Organism:
RAT
Description:
P10980
Residue:
466
  
Inhibitor
Name:
BDBM50001786
Synonyms:
1-(2-{4-[5-chloro-1-(4-fluorophenyl)-1H-indol-3-yl]piperidin-1-yl}ethyl)imidazolidin-2-one CHEMBL12713 | Sertindole
Type:
Small organic molecule
Emp. Form.:
C24H26ClFN4O
Mol. Mass.:
440.941
SMILES:
Fc1ccc(cc1)-n1cc(C2CCN(CCN3CCNC3=O)CC2)c2cc(Cl)ccc12
: