Target
D(3) dopamine receptor
Ligand
BDBM35255
Substrate
Ki
16±n/a nM
Comments
PDSP_2002
Citation
 Schotte, AJanssen, PFGommeren, WLuyten, WHVan Gompel, PLesage, ASDe Loore, KLeysen, JE Risperidone compared with new and reference antipsychotic drugs: in vitro and in vivo receptor binding. Psychopharmacology (Berl) 124:57-73 (1996)  
Target
Name:
D(3) dopamine receptor
Synonyms:
DOPAMINE D3 Dopamine D3 receptor | Drd3
Type:
Protein
Mol. Mass.:
49540.58
Organism:
Rattus norvegicus (Rat)
Description:
P19020
Residue:
446
  
Inhibitor
Name:
BDBM35255
Synonyms:
2-Chlor-11-(2-dimethylaminoaethoxy)-dibenzo(b,f)-thiepin 2-[(8-chlorodibenzo[b,f]thiepin-10-yl)oxy]-N,N-dimethylethanamine Nipolept zotepine
Type:
Small organic molecule
Emp. Form.:
C18H18ClNOS
Mol. Mass.:
331.86
SMILES:
CN(C)CCOC1=Cc2ccccc2Sc2ccc(Cl)cc12
: