Target
Protachykinin-1
Ligand
BDBM22869
Substrate
Ki
1000±n/a nM
Comments
PDSP_552
Citation
 Schotte, AJanssen, PFGommeren, WLuyten, WHVan Gompel, PLesage, ASDe Loore, KLeysen, JE Risperidone compared with new and reference antipsychotic drugs: in vitro and in vivo receptor binding. Psychopharmacology (Berl) 124:57-73 (1996)  
Target
Name:
Protachykinin-1
Synonyms:
NKA Protachykinin-1 TAC1 TKN1_HUMAN
Type:
Enzyme Catalytic Domain
Mol. Mass.:
15006.99
Organism:
Homo sapiens (Human)
Description:
Substance P 0 HUMAN::P20366
Residue:
129
  
Inhibitor
Name:
BDBM22869
Synonyms:
6-chloro-10-(4-methylpiperazin-1-yl)-2,9-diazatricyclo[9.4.0.0^{3,8}]pentadeca-1,3(8),4,6,10,12,14-heptaene Clozapine US10259786, Clozapine
Type:
Small organic molecule
Emp. Form.:
C18H19ClN4
Mol. Mass.:
326.823
SMILES:
CN1CCN(CC1)C1=c2ccccc2=Nc2ccc(Cl)cc2N1
: