Target
D(1A) dopamine receptor
Ligand
BDBM50001885
Substrate
Ki
550±n/a nM
Comments
PDSP_1599
Citation
 Kongsamut, SRoehr, JECai, JHartman, HBWeissensee, PKerman, LLTang, LSandrasagra, A Iloperidone binding to human and rat dopamine and 5-HT receptors. Eur J Pharmacol 317:417-23 (1996)  
Target
Name:
D(1A) dopamine receptor
Synonyms:
DOPAMINE D1 Dopamine D1 high Dopamine receptor Dopamine1-like Drd1a
Type:
Enzyme Catalytic Domain
Mol. Mass.:
49429.75
Organism:
RAT
Description:
P18901
Residue:
446
  
Inhibitor
Name:
BDBM50001885
Synonyms:
(risperidone)3-{2-[4-(6-Fluoro-benzo[d]isoxazol-3-yl)-piperidin-1-yl]-ethyl}-2-methyl-6,7,8,9-tetrahydro-pyrido[1,2-a]pyrimidin-4-one 2-(2-(4-(benzo[d]isoxazol-3-yl)piperidin-1-yl)ethyl)-7,8,9,9a-tetrahydro-1H-pyrido[1,2-a]pyrimidin-4(6H)-one 3-(2-(4-(6-fluorobenzo[d]isoxazol-3-yl)piperidin-1-yl)ethyl)-2-methyl-6,7,8,9-tetrahydropyrido[1,2-a]pyrimidin-4-one 3-{2-[4-(6-Fluoro-benzo[d]isoxazol-3-yl)-piperidin-1-yl]-ethyl}-2-methyl-6,7,8,9-tetrahydro-pyrido[1,2-a]pyrimidin-4-one (Resperidone) 3-{2-[4-(6-Fluoro-benzo[d]isoxazol-3-yl)-piperidin-1-yl]-ethyl}-2-methyl-6,7,8,9-tetrahydro-pyrido[1,2-a]pyrimidin-4-one(risperidone) CHEMBL85 RISPERDAL US10167256, Risperidone US10259786, Risperidone US8802672, Risperidone | WO2023288027, Cmpd Risperidone
Type:
Small organic molecule
Emp. Form.:
C23H27FN4O2
Mol. Mass.:
410.4845
SMILES:
Cc1nc2CCCCn2c(=O)c1CCN1CCC(CC1)c1noc2cc(F)ccc12
: