Target
D(4) dopamine receptor
Ligand
BDBM50095890
Substrate
Ki
1057±n/a nM
Comments
PDSP_1571
Citation
 Kongsamut, SRoehr, JECai, JHartman, HBWeissensee, PKerman, LLTang, LSandrasagra, A Iloperidone binding to human and rat dopamine and 5-HT receptors. Eur J Pharmacol 317:417-23 (1996)  
Target
Name:
D(4) dopamine receptor
Synonyms:
D(2C) dopamine receptor DOPAMINE D4.2 DRD4 Dopamine D4 receptor
Type:
Enzyme
Mol. Mass.:
48373.19
Organism:
Homo sapiens (Human)
Description:
P21917
Residue:
419
  
Inhibitor
Name:
BDBM50095890
Synonyms:
2-[2-(4-Dibenzo[b,f][1,4]thiazepin-11-yl-1-piperazinyl)ethoxy]ethanol CHEMBL716 | QUETIAPINE
Type:
Small organic molecule
Emp. Form.:
C21H25N3O2S
Mol. Mass.:
383.507
SMILES:
OCCOCCN1CCN(CC1)C1=Nc2ccccc2Sc2ccccc12
: