Target
P2X purinoceptor 4
Ligand
BDBM50300129
Substrate
Ki
39.2±n/a nM
Comments
PDSP_3584
Citation
 Garcia-Guzman, MSoto, FGomez-Hernandez, JMLund, PEStühmer, W Characterization of recombinant human P2X4 receptor reveals pharmacological differences to the rat homologue. Mol Pharmacol 51:109-18 (1997)  
Target
Name:
P2X purinoceptor 4
Synonyms:
ATP receptor P2RX4_HUMAN Purinergic receptor | Purinergic, P2X4
Type:
Enzyme Catalytic Domain
Mol. Mass.:
43374.70
Organism:
Homo sapiens (Human)
Description:
Purinergic, P2X4 0 HUMAN::Q99571
Residue:
388
  
Inhibitor
Name:
BDBM50300129
Synonyms:
CHEMBL572528 Cibacron Blue 3Ga
Type:
Small organic molecule
Emp. Form.:
C29H20ClN7O11S3
Mol. Mass.:
774.157
SMILES:
Nc1c(cc(Nc2ccc(Nc3nc(Cl)nc(Nc4ccccc4S(O)(=O)=O)n3)c(c2)S(O)(=O)=O)c2C(=O)c3ccccc3C(=O)c12)S(O)(=O)=O
: