Target
D(2) dopamine receptor
Ligand
BDBM35234
Substrate
Ki
2250±n/a nM
Comments
PDSP_1348
Citation
 Seeman, PGuan, HCNobrega, JJiwa, DMarkstein, RBalk, JHPicetti, RBorrelli, EVan Tol, HH Dopamine D2-like sites in schizophrenia, but not in Alzheimer's, Huntington's, or control brains, for [3H]benzquinoline. Synapse 25:137-46 (1997)  
Target
Name:
D(2) dopamine receptor
Synonyms:
DOPAMINE D2 DOPAMINE D2 Short Dopamine D2 receptor Drd2
Type:
G Protein-Coupled Receptor (GPCR)
Mol. Mass.:
50931.60
Organism:
Rattus norvegicus (rat)
Description:
P61169
Residue:
444
  
Inhibitor
Name:
BDBM35234
Synonyms:
DL-[7-3H]norepinephrine Noradrenaline,(+) | [3H]NE
Type:
radiolabeled ligand
Emp. Form.:
C8H11NO3
Mol. Mass.:
169.1778
SMILES:
NCC(O)c1ccc(O)c(O)c1
: