Target
Metabotropic glutamate receptor 4
Ligand
BDBM17664
Substrate
Ki
2000±n/a nM
Comments
PDSP_3212
Citation
 Conn, PJPin, JP Pharmacology and functions of metabotropic glutamate receptors. Annu Rev Pharmacol Toxicol 37:205-37 (1997)  
Target
Name:
Metabotropic glutamate receptor 4
Synonyms:
GPRC1D GRM4_HUMAN MGLUR4 Metabotropic glutamate receptor 4 (mGlu4) metabotropic glutamate 4
Type:
Protein
Mol. Mass.:
101899.95
Organism:
Homo sapiens (Human)
Description:
Q14833
Residue:
912
  
Inhibitor
Name:
BDBM17664
Synonyms:
(2S)-2-amino-3-(phosphonooxy)propanoic acid L-SOP | L-serine O-phosphate
Type:
Small organic molecule
Emp. Form.:
C3H8NO6P
Mol. Mass.:
185.0725
SMILES:
N[C@@H](COP(O)(O)=O)C(O)=O
: