Target
Metabotropic glutamate receptor 4
Ligand
BDBM85015
Substrate
Ki
>10000±n/a nM
Comments
PDSP_3729
Citation
 Conn, PJPin, JP Pharmacology and functions of metabotropic glutamate receptors. Annu Rev Pharmacol Toxicol 37:205-37 (1997)  
Target
Name:
Metabotropic glutamate receptor 4
Synonyms:
GPRC1D GRM4_HUMAN MGLUR4 Metabotropic glutamate receptor 4 (mGlu4) metabotropic glutamate 4
Type:
Protein
Mol. Mass.:
101899.95
Organism:
Homo sapiens (Human)
Description:
Q14833
Residue:
912
  
Inhibitor
Name:
BDBM85015
Synonyms:
CAS_3964410 NSC_3964410
Type:
Small organic molecule
Emp. Form.:
C9H11NO5S
Mol. Mass.:
245.252
SMILES:
CC(N)(C(O)=O)c1ccc(cc1)S(O)(=O)=O
: