Target
Substance-P receptor
Ligand
BDBM50050650
Substrate
Ki
>10000±n/a nM
Comments
PDSP_1702
Citation
 Sarau, HMGriswold, DEPotts, WFoley, JJSchmidt, DBWebb, EFMartin, LDBrawner, MEElshourbagy, NAMedhurst, ADGiardina, GAHay, DW Nonpeptide tachykinin receptor antagonists: I. Pharmacological and pharmacokinetic characterization of SB 223412, a novel, potent and selective neurokinin-3 receptor antagonist. J Pharmacol Exp Ther 281:1303-11 (1997) Target
Name:
Substance-P receptor
Synonyms:
NK-1 receptor NK1 Receptor NK1R_HUMAN Neurokinin-1 (NK-1) SPR TACR1 Tachykinin receptor 1 (NK1) | tachykinin
Type:
G Protein-Coupled Receptor (GPCR)
Mol. Mass.:
46254.43
Organism:
Homo sapiens (Human)
Description:
P25103
Residue:
407
  
Inhibitor
Name:
BDBM50050650
Synonyms:
(S)-N-{(S)-1-[(S)-1-({[(S)-1-((S)-1-Carbamoyl-3-methylsulfanyl-propylcarbamoyl)-3-methyl-butylcarbamoyl]-methyl}-carbamoyl)-2-phenyl-ethylcarbamoyl]-2-phenyl-ethyl}-3-(3-carboxy-propionylamino)-N-methyl-succinamic acid N-(1-{[1-({[1-(1-Carbamoyl-3-methylsulfanyl-propylcarbamoyl)-3-methyl-butylcarbamoyl]-methyl}-carbamoyl)-2-phenyl-ethyl]-methyl-carbamoyl}-2-phenyl-ethyl)-3-(3-carboxy-propionylamino)-succinamic acid SENKTIDE
Type:
Small organic molecule
Emp. Form.:
C40H55N7O11S
Mol. Mass.:
841.97
SMILES:
CSCCC(NC(=O)C(CC(C)C)NC(=O)CNC(=O)C(Cc1ccccc1)N(C)C(=O)C(Cc1ccccc1)NC(=O)C(CC(O)=O)NC(=O)CCC(O)=O)C(N)=O
: