Target
Substance-K receptor
Ligand
BDBM50050650
Substrate
Ki
>10000±n/a nM
Comments
PDSP_1702
Citation
 Sarau, HMGriswold, DEPotts, WFoley, JJSchmidt, DBWebb, EFMartin, LDBrawner, MEElshourbagy, NAMedhurst, ADGiardina, GAHay, DW Nonpeptide tachykinin receptor antagonists: I. Pharmacological and pharmacokinetic characterization of SB 223412, a novel, potent and selective neurokinin-3 receptor antagonist. J Pharmacol Exp Ther 281:1303-11 (1997) Target
Name:
Substance-K receptor
Synonyms:
NK-2 receptor NK2R NKNAR Neurokinin A receptor Neurokinin-2 (NK-2) SKR TACR2 Tachykinin receptor 2 (NK2) | hnk-3
Type:
Protein
Mol. Mass.:
44455.78
Organism:
Homo sapiens (Human)
Description:
P21452
Residue:
398
  
Inhibitor
Name:
BDBM50050650
Synonyms:
(S)-N-{(S)-1-[(S)-1-({[(S)-1-((S)-1-Carbamoyl-3-methylsulfanyl-propylcarbamoyl)-3-methyl-butylcarbamoyl]-methyl}-carbamoyl)-2-phenyl-ethylcarbamoyl]-2-phenyl-ethyl}-3-(3-carboxy-propionylamino)-N-methyl-succinamic acid N-(1-{[1-({[1-(1-Carbamoyl-3-methylsulfanyl-propylcarbamoyl)-3-methyl-butylcarbamoyl]-methyl}-carbamoyl)-2-phenyl-ethyl]-methyl-carbamoyl}-2-phenyl-ethyl)-3-(3-carboxy-propionylamino)-succinamic acid SENKTIDE
Type:
Small organic molecule
Emp. Form.:
C40H55N7O11S
Mol. Mass.:
841.97
SMILES:
CSCCC(NC(=O)C(CC(C)C)NC(=O)CNC(=O)C(Cc1ccccc1)N(C)C(=O)C(Cc1ccccc1)NC(=O)C(CC(O)=O)NC(=O)CCC(O)=O)C(N)=O
: