Target
Vasopressin V1b receptor
Ligand
BDBM85095
Substrate
Ki
>10000±n/a nM
Comments
PDSP_1980
Citation
 Tahara, ATomura, YWada, KIKusayama, TTsukada, JTakanashi, MYatsu, TUchida, WTanaka, A Pharmacological profile of YM087, a novel potent nonpeptide vasopressin V1A and V2 receptor antagonist, in vitro and in vivo. J Pharmacol Exp Ther 282:301-8 (1997) Target
Name:
Vasopressin V1b receptor
Synonyms:
Avpr1b VASOPRESSIN V1B Vasopressin receptor
Type:
Enzyme Catalytic Domain
Mol. Mass.:
47104.48
Organism:
RAT
Description:
VASOPRESSIN V1B AVPR1B RAT::P48974
Residue:
425
  
Inhibitor
Name:
BDBM85095
Synonyms:
CAS_151171 NSC_151171 | YM087
Type:
Small organic molecule
Emp. Form.:
C32H26N4O2
Mol. Mass.:
498.5744
SMILES:
Cc1nc-2c(CCN(C(=O)c3ccc(NC(=O)c4ccccc4-c4ccccc4)cc3)c3ccccc-23)[nH]1
: