Target
Vasopressin V2 receptor
Ligand
BDBM35667
Substrate
Ki
3.23±n/a nM
Comments
PDSP_336
Citation
 Tahara, ATomura, YWada, KIKusayama, TTsukada, JTakanashi, MYatsu, TUchida, WTanaka, A Pharmacological profile of YM087, a novel potent nonpeptide vasopressin V1A and V2 receptor antagonist, in vitro and in vivo. J Pharmacol Exp Ther 282:301-8 (1997) Target
Name:
Vasopressin V2 receptor
Synonyms:
AVPR V2 Avpr2 V2R_RAT Vasopressin receptor
Type:
G-protein coupled receptor
Mol. Mass.:
40761.85
Organism:
Rattus norvegicus (Rat)
Description:
Residue:
371
  
Inhibitor
Name:
BDBM35667
Synonyms:
AVP US10131692, 44 (AVP) [3H]Argipressin tannate | [3H]vasopressin
Type:
radiolabeled ligand
Emp. Form.:
C46H65N15O12S2
Mol. Mass.:
1084.232
SMILES:
[#7]-[#6@H]-1-[#6]-[#16]-[#16]-[#6]-[#6@H](-[#7]-[#6](=O)-[#6@H](-[#6]-[#6](-[#7])=O)-[#7]-[#6](=O)-[#6@H](-[#6]-[#6]-[#6](-[#7])=O)-[#7]-[#6](=O)-[#6@H](-[#6]-c2ccccc2)-[#7]-[#6](=O)-[#6@H](-[#6]-c2ccc(-[#8])cc2)-[#7]-[#6]-1=O)-[#6](=O)-[#7]-1-[#6]-[#6]-[#6]-[#6@H]-1-[#6](=O)-[#7]-[#6@@H](-[#6]-[#6]-[#6]\[#7]=[#6](\[#7])-[#7])-[#6](=O)-[#7]-[#6]-[#6](-[#7])=O
: