Target
Nicotinic acetylcholine receptor
Ligand
BDBM50061562
Substrate
Ki
53±n/a nM
Comments
PDSP_666
Citation
 Dávila-García, MIMusachio, JLPerry, DCXiao, YHorti, ALondon, EDDannals, RFKellar, KJ [125I]IPH, an epibatidine analog, binds with high affinity to neuronal nicotinic cholinergic receptors. J Pharmacol Exp Ther 282:445-51 (1997) Target
Name:
Nicotinic acetylcholine receptor
Synonyms:
Nicotinic acetylcholine receptor | n-AChR
Type:
Enzyme Catalytic Domain
Mol. Mass.:
2478.99
Organism:
RAT
Description:
n-AChR 0 RAT::Q62594
Residue:
23
  
Inhibitor
Name:
BDBM50061562
Synonyms:
(12R,13aR)-12-Methoxy-1,4,5,6,9,11,12,13-octahydro-8H-pyrano[4',3':3,4]pyrido[2,1-i]indol-2-one Dihydro-Beta-erythroidine
Type:
Small organic molecule
Emp. Form.:
C16H21NO3
Mol. Mass.:
275.3428
SMILES:
CO[C@@H]1CC=C2CCN3CCC4=C(CC(=O)OC4)[C@@]23C1
: