Target
5-hydroxytryptamine receptor 2A
Ligand
BDBM30130
Substrate
Ki
147.91±n/a nM
Comments
PDSP_830
Citation
 Bonhaus, DWWeinhardt, KKTaylor, MDeSouza, AMcNeeley, PMSzczepanski, KFontana, DJTrinh, JRocha, CLDawson, MWFlippin, LAEglen, RM RS-102221: a novel high affinity and selective, 5-HT2C receptor antagonist. Neuropharmacology 36:621-9 (1997)  
Target
Name:
5-hydroxytryptamine receptor 2A
Synonyms:
5-HT-2 5-HT2A 5-hydroxytryptamine receptor 2A (5HT-2A) 5HT2A_HUMAN HTR2A | Serotonin receptor 2A
Type:
undefined
Mol. Mass.:
52607.65
Organism:
Homo sapiens (Human)
Description:
P28223
Residue:
471
  
Inhibitor
Name:
BDBM30130
Synonyms:
CHEMBL1201082 Fluoxetin Prozac cid_62857
Type:
Small organic molecule
Emp. Form.:
C17H18F3NO
Mol. Mass.:
309.3261
SMILES:
CNCCC(Oc1ccc(cc1)C(F)(F)F)c1ccccc1
: