Target
5-hydroxytryptamine receptor 2B
Ligand
BDBM30130
Substrate
Ki
>10000±n/a nM
Comments
PDSP_830
Citation
 Bonhaus, DWWeinhardt, KKTaylor, MDeSouza, AMcNeeley, PMSzczepanski, KFontana, DJTrinh, JRocha, CLDawson, MWFlippin, LAEglen, RM RS-102221: a novel high affinity and selective, 5-HT2C receptor antagonist. Neuropharmacology 36:621-9 (1997)  
Target
Name:
5-hydroxytryptamine receptor 2B
Synonyms:
5-HT-2B 5-hydroxytryptamine (serotonin) receptor 2B [Homo sapiens] 5-hydroxytryptamine receptor 2C (5HT2C) HTR2B Serotonin 2b (5-HT2b) receptor | Serotonin Receptor 2B
Type:
G Protein-Coupled Receptor (GPCR)
Mol. Mass.:
54312.47
Organism:
Homo sapiens (Human)
Description:
Receptor binding assays were performed using human clone stably expressed in CHO cells.
Residue:
481
  
Inhibitor
Name:
BDBM30130
Synonyms:
CHEMBL1201082 Fluoxetin Prozac cid_62857
Type:
Small organic molecule
Emp. Form.:
C17H18F3NO
Mol. Mass.:
309.3261
SMILES:
CNCCC(Oc1ccc(cc1)C(F)(F)F)c1ccccc1
: