Target
5-hydroxytryptamine receptor 6
Ligand
BDBM22867
Substrate
Ki
30.19±n/a nM
Comments
PDSP_1079
Citation
 Boess, FGMonsma, FJCarolo, CMeyer, VRudler, AZwingelstein, CSleight, AJ Functional and radioligand binding characterization of rat 5-HT6 receptors stably expressed in HEK293 cells. Neuropharmacology 36:713-20 (1997)  
Target
Name:
5-hydroxytryptamine receptor 6
Synonyms:
5-HT-6 5-hydroxytryptamine receptor 6 Htr6 Serotonin (5-HT) receptor Serotonin receptor 6
Type:
Enzyme Catalytic Domain
Mol. Mass.:
46945.51
Organism:
RAT
Description:
5-HT6 HTR6 RAT::P31388
Residue:
436
  
Inhibitor
Name:
BDBM22867
Synonyms:
1,1-diethyl-3-[(8beta)-6-methyl-9,10-didehydroergolin-8-yl]urea 8R-lisuride | LISURIDE
Type:
Small organic molecule
Emp. Form.:
C20H26N4O
Mol. Mass.:
338.4466
SMILES:
[H][C@@]12Cc3c[nH]c4cccc(C1=C[C@H](CN2C)NC(=O)N(CC)CC)c34
: