Target
5-hydroxytryptamine receptor 4
Ligand
BDBM85027
Substrate
Ki
0.00040±n/a nM
Comments
PDSP_1619
Citation
 Claeysen, SFaye, PSebben, MLemaire, SBockaert, JDumuis, A Cloning and expression of human 5-HT4S receptors. Effect of receptor density on their coupling to adenylyl cyclase. Neuroreport 8:3189-96 (1997)  
Target
Name:
5-hydroxytryptamine receptor 4
Synonyms:
5-HT-4 5-HT4L 5-hydroxytryptamine receptor 4 Htr4 Serotonin 4 (5-HT4) receptor
Type:
Enzyme Catalytic Domain
Mol. Mass.:
46117.31
Organism:
RAT
Description:
5-HT4 HTR4 RAT::Q62758
Residue:
406
  
Inhibitor
Name:
BDBM85027
Synonyms:
1-(7-Chloro-8-amino-1,4-benzodioxane-5-yl)-3-[1-[3-(3,4-dimethoxyphenyl)propyl]piperidine-4-yl]propane-1-one | RS 100235
Type:
Small organic molecule
Emp. Form.:
C27H35ClN2O5
Mol. Mass.:
503.03
SMILES:
COc1ccc(CCCN2CCC(CCC(=O)c3cc(Cl)c(N)c4OCCOc34)CC2)cc1OC
: