Target
5-hydroxytryptamine receptor 4
Ligand
BDBM85026
Substrate
Ki
0.0056±n/a nM
Comments
PDSP_1664
Citation
 Claeysen, SFaye, PSebben, MLemaire, SBockaert, JDumuis, A Cloning and expression of human 5-HT4S receptors. Effect of receptor density on their coupling to adenylyl cyclase. Neuroreport 8:3189-96 (1997)  
Target
Name:
5-hydroxytryptamine receptor 4
Synonyms:
5-HT-4 5-HT4L 5-hydroxytryptamine receptor 4 Htr4 Serotonin 4 (5-HT4) receptor
Type:
Enzyme Catalytic Domain
Mol. Mass.:
46117.31
Organism:
RAT
Description:
5-HT4 HTR4 RAT::Q62758
Residue:
406
  
Inhibitor
Name:
BDBM85026
Synonyms:
N-(1-Butylpiperidine-4-ylmethyl)-1,2-(trimethyleneoxy)-1H-indole-3-carboxamide SB-207266
Type:
Small organic molecule
Emp. Form.:
C22H31N3O2
Mol. Mass.:
369.5004
SMILES:
CCCCN1CCC(CNC(=O)c2c3OCCCn3c3ccccc23)CC1
: