Target
Histamine H1 receptor
Ligand
BDBM85197
Substrate
Ki
11±n/a nM
Comments
PDSP_1907
Citation
 Owens, MJMorgan, WNPlott, SJNemeroff, CB Neurotransmitter receptor and transporter binding profile of antidepressants and their metabolites. J Pharmacol Exp Ther 283:1305-22 (1997) Target
Name:
Histamine H1 receptor
Synonyms:
HISTAMINE H1 HRH1_CAVPO
Type:
G Protein-Coupled Receptor (GPCR)
Mol. Mass.:
55641.53
Organism:
Cavia porcellus (domestic guinea pig)
Description:
Guinea pig cerebellum was used in binding assay.
Residue:
488
  
Inhibitor
Name:
BDBM85197
Synonyms:
Triazoledione
Type:
Small organic molecule
Emp. Form.:
C23H28ClN5O3
Mol. Mass.:
457.953
SMILES:
Clc1cccc(c1)N1CCN(CCCn2[nH]c(=O)n(CCOc3ccccc3)c2=O)CC1
: