Target
Sodium-dependent noradrenaline transporter
Ligand
BDBM50028066
Substrate
Ki
2365±n/a nM
Comments
PDSP_639
Citation
 Owens, MJMorgan, WNPlott, SJNemeroff, CB Neurotransmitter receptor and transporter binding profile of antidepressants and their metabolites. J Pharmacol Exp Ther 283:1305-22 (1997) Target
Name:
Sodium-dependent noradrenaline transporter
Synonyms:
Monoamine transporter NET Noradrenaline Transporter (NET) Norepinephrine transporter protein (NET) SLC6A2 Sodium-dependent noradrenaline transporter (NET) | Solute carrier family 6 member 2
Type:
Multi-pass membrane protein
Mol. Mass.:
69337.72
Organism:
Homo sapiens (Human)
Description:
P23975
Residue:
617
  
Inhibitor
Name:
BDBM50028066
Synonyms:
4-(3,4-Dichloro-phenyl)-1,2,3,4-tetrahydro-naphthalen-1-ylamine, HCl Desmethylsertraline
Type:
Small organic molecule
Emp. Form.:
C16H15Cl2N
Mol. Mass.:
292.203
SMILES:
N[C@H]1CC[C@@H](c2ccc(Cl)c(Cl)c2)c2ccccc12
: