Target
Sodium-dependent noradrenaline transporter
Ligand
BDBM22416
Substrate
Ki
328±n/a nM
Comments
PDSP_1439
Citation
 Owens, MJMorgan, WNPlott, SJNemeroff, CB Neurotransmitter receptor and transporter binding profile of antidepressants and their metabolites. J Pharmacol Exp Ther 283:1305-22 (1997) Target
Name:
Sodium-dependent noradrenaline transporter
Synonyms:
Monoamine transporter NET Noradrenaline Transporter (NET) Norepinephrine transporter protein (NET) SLC6A2 Sodium-dependent noradrenaline transporter (NET) | Solute carrier family 6 member 2
Type:
Multi-pass membrane protein
Mol. Mass.:
69337.72
Organism:
Homo sapiens (Human)
Description:
P23975
Residue:
617
  
Inhibitor
Name:
BDBM22416
Synonyms:
(3S,4R)-3-[(1,3-benzodioxol-5-yloxy)methyl]-4-(4-fluorophenyl)piperidine CHEMBL490 US09969700, Paroxetine [3H]Paroxetine
Type:
radiolabeled ligand
Emp. Form.:
C19H20FNO3
Mol. Mass.:
329.3654
SMILES:
Fc1ccc(cc1)[C@@H]1CCNC[C@H]1COc1ccc2OCOc2c1
: