Target
Alpha-1A adrenergic receptor
Ligand
BDBM22869
Substrate
Ki
3.7±n/a nM
Comments
PDSP_552
Citation
 Arnt, JSkarsfeldt, T Do novel antipsychotics have similar pharmacological characteristics? A review of the evidence. Neuropsychopharmacology 18:63-101 (1998)  
Target
Name:
Alpha-1A adrenergic receptor
Synonyms:
ADA1A_RAT Adra1c Alpha-1A adrenoceptor Alpha-1C adrenergic receptor | adrenergic Alpha1A
Type:
Protein
Mol. Mass.:
51620.15
Organism:
Rattus norvegicus (Rat)
Description:
P43140
Residue:
466
  
Inhibitor
Name:
BDBM22869
Synonyms:
6-chloro-10-(4-methylpiperazin-1-yl)-2,9-diazatricyclo[9.4.0.0^{3,8}]pentadeca-1,3(8),4,6,10,12,14-heptaene Clozapine US10259786, Clozapine
Type:
Small organic molecule
Emp. Form.:
C18H19ClN4
Mol. Mass.:
326.823
SMILES:
CN1CCN(CC1)C1=c2ccccc2=Nc2ccc(Cl)cc2N1
: