Target
Muscarinic acetylcholine receptor M2
Ligand
BDBM50176065
Substrate
Ki
6.7±n/a nM
Comments
PDSP_111
Citation
 Kovacs, IYamamura, HIWaite, SLVarga, EVRoeske, WR Pharmacological comparison of the cloned human and rat M2 muscarinic receptor genes expressed in the murine fibroblast (B82) cell line. J Pharmacol Exp Ther 284:500-7 (1998) Target
Name:
Muscarinic acetylcholine receptor M2
Synonyms:
ACM2_RAT Chrm-2 | Chrm2
Type:
Enzyme Catalytic Domain
Mol. Mass.:
51555.53
Organism:
RAT
Description:
P10980
Residue:
466
  
Inhibitor
Name:
BDBM50176065
Synonyms:
4-DAMP Acetic acid 4-[(4-acetoxy-phenyl)-pyridin-2-yl-methyl]-phenyl ester CHEMBL76897
Type:
Small organic molecule
Emp. Form.:
C21H26NO2
Mol. Mass.:
324.4361
SMILES:
C[N+]1(C)CCC(CC1)OC(=O)C(c1ccccc1)c1ccccc1
: