Target
Nischarin
Ligand
BDBM50001922
Substrate
Ki
>10000±n/a nM
Comments
PDSP_1290
Citation
 Molderings, GJDonecker, KBurian, MSimon, WASchröder, DWGöthert, M Characterization of I2 imidazoline and sigma binding sites in the rat and human stomach. J Pharmacol Exp Ther 285:170-7 (1998) Target
Name:
Nischarin
Synonyms:
Imidazoline I1 Nisch | Nischarin
Type:
Enzyme Catalytic Domain
Mol. Mass.:
166460.59
Organism:
RAT
Description:
Q4G017
Residue:
1502
  
Inhibitor
Name:
BDBM50001922
Synonyms:
2-Naphthalen-1-ylmethyl-4,5-dihydro-1H-imidazole; hydrochloride CHEMBL1706 Nafazair Naphazoline Nitrate Opcon cid_11079
Type:
Small organic molecule
Emp. Form.:
C14H14N2
Mol. Mass.:
210.2744
SMILES:
C(C1=NCCN1)c1cccc2ccccc12
: