Target
Glutamate receptor 3
Ligand
BDBM50289504
Substrate
Ki
470±n/a nM
Comments
PDSP_554
Citation
 Varney, MARao, SPJachec, CDeal, CHess, SDDaggett, LPLin, FJohnson, ECVeliçelebi, G Pharmacological characterization of the human ionotropic glutamate receptor subtype GluR3 stably expressed in mammalian cells. J Pharmacol Exp Ther 285:358-70 (1998) Target
Name:
Glutamate receptor 3
Synonyms:
GRIA3_RAT Glutamate receptor 3 Glutamate-AMPA | Gria3
Type:
Enzyme Catalytic Domain
Mol. Mass.:
100383.57
Organism:
RAT
Description:
Glutamate-AMPA GRIA3 RAT::P19492
Residue:
888
  
Inhibitor
Name:
BDBM50289504
Synonyms:
7-Cyano-3-hydroxy-6-nitro-quinoxalin-2-ol anion | CNQX
Type:
Small organic molecule
Emp. Form.:
C9H3N4O4
Mol. Mass.:
231.1451
SMILES:
[O-][N+](=O)c1cc2[n-]c(=[OH+])c(=O)[n-]c2cc1C#N
: